Reaction Details
TargetAurora kinase A
LigandBDBM50316501
Substrate/Competitorn/a
Meas. Tech.ChEMBL_630519 (CHEMBL1104791)
IC50 3392±n/a nM
Citation Adams, NDAdams, JLBurgess, JLChaudhari, AMCopeland, RADonatelli, CADrewry, DHFisher, KEHamajima, THardwicke, MAHuffman, WFKoretke-Brown, KKLai, ZVMcDonald, OBNakamura, HNewlander, KAOleykowski, CAParrish, CAPatrick, DRPlant, RSarpong, MASasaki, KSchmidt, SJSilva, DJSutton, DTang, JThompson, CSTummino, PJWang, JCXiang, HYang, JDhanak, D Discovery of GSK1070916, a potent and selective inhibitor of Aurora B/C kinase. J Med Chem53:3973-4001 (2010) 
 
Aurora kinase A
Name:Aurora kinase A
Type:Serine/threonine-protein kinase
Mol. Mass.:45830.98
Organism:Homo sapiens (Human)
Description:O14965
Residue:403
BDBM50316501
NameBDBM50316501
Synonyms:CHEMBL1094506 | N-Ethyl-2-[3-(4-{[(phenylamino)carbonyl]amino}phenyl)-4-(1H-pyrrolo[2,3-b]pyridin-4-yl)-1H-pyrazol-1-yl]acetamide
TypeSmall organic molecule
Emp. Form.C27H25N7O2
Mol. Mass.479.5331
SMILESCCNC(=O)Cn1cc(c(n1)-c1ccc(NC(=O)Nc2ccccc2)cc1)-c1ccnc2[nH]ccc12