Reaction Details
TargetSerine/threonine-protein kinase SIK1
LigandBDBM50315769
Substrate/Competitorn/a
Meas. Tech.ChEMBL_630530 (CHEMBL1104802)
IC50 70±n/a nM
Citation Adams, NDAdams, JLBurgess, JLChaudhari, AMCopeland, RADonatelli, CADrewry, DHFisher, KEHamajima, THardwicke, MAHuffman, WFKoretke-Brown, KKLai, ZVMcDonald, OBNakamura, HNewlander, KAOleykowski, CAParrish, CAPatrick, DRPlant, RSarpong, MASasaki, KSchmidt, SJSilva, DJSutton, DTang, JThompson, CSTummino, PJWang, JCXiang, HYang, JDhanak, D Discovery of GSK1070916, a potent and selective inhibitor of Aurora B/C kinase. J Med Chem53:3973-4001 (2010) 
 
Serine/threonine-protein kinase SIK1
Name:Serine/threonine-protein kinase SIK1
Type:PROTEIN
Mol. Mass.:84908.20
Organism:Homo sapiens (Human)
Description:ChEMBL_774213
Residue:783
BDBM50315769
NameBDBM50315769
Synonyms:3-(4-(4-(2-(3-((dimethylamino)methyl)phenyl)-1H-pyrrolo[2,3-b]pyridin-4-yl)-1-ethyl-1H-pyrazol-3-yl)phenyl)-1,1-dimethylurea CHEMBL1090479 | GSK-1070916
TypeSmall organic molecule
Emp. Form.C30H33N7O
Mol. Mass.507.6293
SMILESCCn1cc(c(n1)-c1ccc(NC(=O)N(C)C)cc1)-c1ccnc2[nH]c(cc12)-c1cccc(CN(C)C)c1