Reaction Details
TargetDelta-type opioid receptor
LigandBDBM50316618
Substrate/Competitorn/a
Meas. Tech.ChEMBL_631962 (CHEMBL1104718)
Ki>1000±n/a nM
Citation Geiger, CZelenka, CLehmkuhl, KSchepmann, DEnglberger, WWünsch, B Conformationally constrained kappa receptor agonists: stereoselective synthesis and pharmacological evaluation of 6,8-diazabicyclo[3.2.2]nonane derivatives. J Med Chem53:4212-22 (2010) 
 
Delta-type opioid receptor
Name:Delta-type opioid receptor
Type:G Protein-Coupled Receptor (GPCR)
Mol. Mass.:40382.98
Organism:Homo sapiens (Human)
Description:Competition binding assays were carried out using membrane preparations from transfected HN9.10 cells that constitutively expressed the delta opioid receptor.
Residue:372
BDBM50316618
NameBDBM50316618
Synonyms:(-)-1-[(1R,2R,5S)-6-Benzyl-2-(pyrrolidin-1-yl)-6,8-diazabicyclo[3.2.2]nonan-8-yl]-2-(3,4-dichlorophenyl)ethanone | CHEMBL1096473
TypeSmall organic molecule
Emp. Form.C26H31Cl2N3O
Mol. Mass.472.45
SMILESClc1ccc(CC(=O)N2C[C@@H]3CC[C@H]([C@H]2CN3Cc2ccccc2)N2CCCC2)cc1Cl