Reaction Details
TargetSigma non-opioid intracellular receptor 1
LigandBDBM50316612
Substrate/Competitorn/a
Meas. Tech.ChEMBL_631967 (CHEMBL1104723)
Ki>1000±n/a nM
Citation Geiger, CZelenka, CLehmkuhl, KSchepmann, DEnglberger, WWünsch, B Conformationally constrained kappa receptor agonists: stereoselective synthesis and pharmacological evaluation of 6,8-diazabicyclo[3.2.2]nonane derivatives. J Med Chem53:4212-22 (2010) 
 
Sigma non-opioid intracellular receptor 1
Name:Sigma non-opioid intracellular receptor 1
Type:Protein
Mol. Mass.:25307.17
Organism:Cavia porcellus (Guinea pig)
Description:Q60492
Residue:223
BDBM50316612
NameBDBM50316612
Synonyms:(-)-1-{(1R,2S,5S)-8-[2-(3,4-Dichlorophenyl)acetyl]-2-(pyrrolidin-1-yl)-6,8-diazabicyclo[3.2.2]nonan-8-yl}propan-1-one | CHEMBL1094236
TypeSmall organic molecule
Emp. Form.C22H29Cl2N3O2
Mol. Mass.438.391
SMILESCCC(=O)N1C[C@@H]2[C@H](CC[C@H]1CN2C(=O)Cc1ccc(Cl)c(Cl)c1)N1CCCC1