Reaction Details
TargetKappa-type opioid receptor
LigandBDBM50316616
Substrate/Competitorn/a
Meas. Tech.ChEMBL_631975 (CHEMBL1107423)
Ki>1000±n/a nM
Citation Geiger, CZelenka, CLehmkuhl, KSchepmann, DEnglberger, WWünsch, B Conformationally constrained kappa receptor agonists: stereoselective synthesis and pharmacological evaluation of 6,8-diazabicyclo[3.2.2]nonane derivatives. J Med Chem53:4212-22 (2010) 
 
Kappa-type opioid receptor
Name:Kappa-type opioid receptor
Type:G Protein-Coupled Receptor (GPCR)
Mol. Mass.:42648.76
Organism:Homo sapiens (Human)
Description:P41145
Residue:380
BDBM50316616
NameBDBM50316616
Synonyms:(-)-Methyl(1R,2S,5S)-8-[2-(3,4-Dichlorophenyl)acetyl]-2-(pyrrolidin-1-yl)-6,8-diazabicyclo[3.2.2]nonane-6-carboxylate | CHEMBL1096675
TypeSmall organic molecule
Emp. Form.C21H27Cl2N3O3
Mol. Mass.440.363
SMILESCOC(=O)N1C[C@@H]2[C@H](CC[C@H]1CN2C(=O)Cc1ccc(Cl)c(Cl)c1)N1CCCC1