Reaction Details
TargetKappa-type opioid receptor
LigandBDBM50316620
Substrate/Competitorn/a
Meas. Tech.ChEMBL_631975 (CHEMBL1107423)
Ki>1000±n/a nM
Citation Geiger, CZelenka, CLehmkuhl, KSchepmann, DEnglberger, WWünsch, B Conformationally constrained kappa receptor agonists: stereoselective synthesis and pharmacological evaluation of 6,8-diazabicyclo[3.2.2]nonane derivatives. J Med Chem53:4212-22 (2010) 
 
Kappa-type opioid receptor
Name:Kappa-type opioid receptor
Type:G Protein-Coupled Receptor (GPCR)
Mol. Mass.:42648.76
Organism:Homo sapiens (Human)
Description:P41145
Residue:380
BDBM50316620
NameBDBM50316620
Synonyms:(-)-1-[(1R,2S,5S)-6-Benzyl-2-(pyrrolidin-1-yl)-6,8-diazabicyclo-[3.2.2]nonan-8-yl]-2-(3,4-dichlorophenyl)ethanone | CHEMBL1095520
TypeSmall organic molecule
Emp. Form.C26H31Cl2N3O
Mol. Mass.472.45
SMILESClc1ccc(CC(=O)N2C[C@@H]3CC[C@@H]([C@H]2CN3Cc2ccccc2)N2CCCC2)cc1Cl