Reaction Details
TargetKappa-type opioid receptor
LigandBDBM50316611
Substrate/Competitorn/a
Meas. Tech.ChEMBL_631958 (CHEMBL1104714)
Ki 13±n/a nM
Citation Geiger, CZelenka, CLehmkuhl, KSchepmann, DEnglberger, WWünsch, B Conformationally constrained kappa receptor agonists: stereoselective synthesis and pharmacological evaluation of 6,8-diazabicyclo[3.2.2]nonane derivatives. J Med Chem53:4212-22 (2010) 
 
Kappa-type opioid receptor
Name:Kappa-type opioid receptor
Type:G Protein-Coupled Receptor (GPCR)
Mol. Mass.:42744.99
Organism:Cavia porcellus (domestic guinea pig)
Description:P41144
Residue:380
BDBM50316611
NameBDBM50316611
Synonyms:(+)-1-{(1S,2R,5R)-8-[2-(3,4-Dichlorophenyl)acetyl]-2-(pyrrolidin-1-yl)-6,8-diazabicyclo[3.2.2]nonan-8-yl}propan-1-one | CHEMBL1094237
TypeSmall organic molecule
Emp. Form.C22H29Cl2N3O2
Mol. Mass.438.391
SMILESCCC(=O)N1C[C@H]2[C@@H](CC[C@@H]1CN2C(=O)Cc1ccc(Cl)c(Cl)c1)N1CCCC1