Reaction Details
TargetcGMP-specific 3',5'-cyclic phosphodiesterase
LigandBDBM50316645
Substrate/Competitorn/a
Meas. Tech.ChEMBL_632193 (CHEMBL1106526)
IC50 0.08±n/a nM
Citation Tollefson, MBAcker, BAJacobsen, EJHughes, ROWalker, JKFox, DNPalmer, MJFreeman, SKYu, YBond, BR 1-(2-Ethoxyethyl)-1H-pyrazolo[4,3-d]pyrimidines as potent phosphodiesterase 5 (PDE5) inhibitors. Bioorg Med Chem Lett20:3120-4 (2010) cGMP-specific 3',5'-cyclic phosphodiesterase
Name:cGMP-specific 3',5'-cyclic phosphodiesterase
Type:Protein
Mol. Mass.:99975.83
Organism:Homo sapiens (Human)
Description:O76074
Residue:875
BDBM50316645
NameBDBM50316645
Synonyms:1-(1-(2-ethoxyethyl)-3-ethyl-7-(4-methylpyridin-2-ylamino)-1H-pyrazolo[4,3-d]pyrimidin-5-yl)piperidine-3-carboxamide | CHEMBL1098141
TypeSmall organic molecule
Emp. Form.C23H32N8O2
Mol. Mass.452.5526
SMILESCCOCCn1nc(CC)c2nc(nc(Nc3cc(C)ccn3)c12)N1CCCC(C1)C(N)=O