Reaction Details
TargetcGMP-specific 3',5'-cyclic phosphodiesterase
LigandBDBM50316659
Substrate/Competitorn/a
Meas. Tech.ChEMBL_632193 (CHEMBL1106526)
IC50 0.89±n/a nM
Citation Tollefson, MBAcker, BAJacobsen, EJHughes, ROWalker, JKFox, DNPalmer, MJFreeman, SKYu, YBond, BR 1-(2-Ethoxyethyl)-1H-pyrazolo[4,3-d]pyrimidines as potent phosphodiesterase 5 (PDE5) inhibitors. Bioorg Med Chem Lett20:3120-4 (2010) cGMP-specific 3',5'-cyclic phosphodiesterase
Name:cGMP-specific 3',5'-cyclic phosphodiesterase
Type:Protein
Mol. Mass.:99975.83
Organism:Homo sapiens (Human)
Description:O76074
Residue:875
BDBM50316659
NameBDBM50316659
Synonyms:1-(2-ethoxyethyl)-3-ethyl-5-(4-methylpiperazin-1-yl)-N-(4-methylpyridin-2-yl)-1H-pyrazolo[4,3-d]pyrimidin-7-amine | CHEMBL1094211
TypeSmall organic molecule
Emp. Form.C22H32N8O
Mol. Mass.424.5425
SMILESCCOCCn1nc(CC)c2nc(nc(Nc3cc(C)ccn3)c12)N1CCN(C)CC1