Reaction Details
TargetMelatonin receptor type 1A
LigandBDBM50316692
Substrate/Competitorn/a
Meas. Tech.ChEMBL_632470 (CHEMBL1108334)
Ki 0.09±n/a nM
Citation Mésangeau, CPérès, BDescamps-François, CChavatte, PAudinot, VCoumailleau, SBoutin, JADelagrange, PBennejean, CRenard, PCaignard, DHBerthelot, PYous, S Design, synthesis and pharmacological evaluation of novel naphthalenic derivatives as selective MT(1) melatoninergic ligands. Bioorg Med Chem18:3426-36 (2010) 
 
Melatonin receptor type 1A
Name:Melatonin receptor type 1A
Type:Enzyme
Mol. Mass.:39392.94
Organism:Homo sapiens (Human)
Description:P48039
Residue:350
BDBM50316692
NameBDBM50316692
Synonyms:CHEMBL1094212 | N-[2-(7-{4-(4'-Hydroxymethylbiphenyl-4-yloxy}butoxy)-naphthalen-1-yl)ethyl]acetamide
TypeSmall organic molecule
Emp. Form.C31H33NO4
Mol. Mass.483.598
SMILESCC(=O)NCCc1cccc2ccc(OCCCCOc3ccc(cc3)-c3ccc(CO)cc3)cc12