Reaction Details
TargetProlyl endopeptidase
LigandBDBM50242173
Substrate/Competitorn/a
Meas. Tech.ChEMBL_632264 (CHEMBL1110126)
IC50 12300±n/a nM
Citation Lawandi, JGerber-Lemaire, SJuillerat-Jeanneret, LMoitessier, N Inhibitors of prolyl oligopeptidases for the therapy of human diseases: defining diseases and inhibitors. J Med Chem53:3423-38 (2010) 
 
Prolyl endopeptidase
Name:Prolyl endopeptidase
Type:Enzyme
Mol. Mass.:80688.50
Organism:Homo sapiens (Human)
Description:P48147
Residue:710
BDBM50242173
NameBDBM50242173
Synonyms:(2S,3S,4S,5R,6S)-6-(5,6-dihydroxy-4-oxo-2-phenyl-4H-chromen-7-yloxy)-3,4,5-trihydroxy-tetrahydro-2H-pyran-2-carboxylic acid Baicalin (9) baicalin
TypeSmall organic molecule
Emp. Form.C21H18O11
Mol. Mass.446.361
SMILESO[C@H]1[C@H](Oc2cc3oc(cc(=O)c3c(O)c2O)-c2ccccc2)O[C@@H]([C@@H](O)[C@@H]1O)C(O)=O