Reaction Details
TargetProlyl endopeptidase
LigandBDBM50316827
Substrate/Competitorn/a
Meas. Tech.ChEMBL_632258 (CHEMBL1110120)
Ki 70000±n/a nM
Citation Lawandi, JGerber-Lemaire, SJuillerat-Jeanneret, LMoitessier, N Inhibitors of prolyl oligopeptidases for the therapy of human diseases: defining diseases and inhibitors. J Med Chem53:3423-38 (2010) 
 
Prolyl endopeptidase
Name:Prolyl endopeptidase
Type:PROTEIN
Mol. Mass.:80630.39
Organism:Bos taurus
Description:ChEMBL_632258
Residue:710
BDBM50316827
NameBDBM50316827
Synonyms:(S)-benzyl 2-(2-(2-chloroacetyl)pyrrolidin-1-yl)-2-oxoethylcarbamate | CHEMBL1087483
TypeSmall organic molecule
Emp. Form.C16H19ClN2O4
Mol. Mass.338.786
SMILESClCC(=O)[C@@H]1CCCN1C(=O)CNC(=O)OCc1ccccc1