Reaction Details
TargetProlyl endopeptidase
LigandBDBM50316836
Substrate/Competitorn/a
Meas. Tech.ChEMBL_632260 (CHEMBL1110122)
Ki 33±n/a nM
Citation Lawandi, JGerber-Lemaire, SJuillerat-Jeanneret, LMoitessier, N Inhibitors of prolyl oligopeptidases for the therapy of human diseases: defining diseases and inhibitors. J Med Chem53:3423-38 (2010) 
 
Prolyl endopeptidase
Name:Prolyl endopeptidase
Type:PROTEIN
Mol. Mass.:80738.55
Organism:Mus musculus
Description:ChEMBL_1336164
Residue:710
BDBM50316836
NameBDBM50316836
Synonyms:(9H-fluoren-9-yl)methyl(S)-1-((S)-2-cyanopyrrolidin-1-yl)-5-guanidino-1-oxopentan-2-ylcarbamate | CHEMBL1097128
TypeSmall organic molecule
Emp. Form.C26H30N6O3
Mol. Mass.474.5548
SMILES[#7]\[#6](-[#7])=[#7]\[#6]-[#6]-[#6]-[#6@H](-[#7]-[#6](=O)-[#8]-[#6]-[#6]-1-c2ccccc2-c2ccccc-12)-[#6](=O)-[#7]-1-[#6]-[#6]-[#6]-[#6@H]-1C#N