Reaction Details
TargetProlyl endopeptidase
LigandBDBM50051539
Substrate/Competitorn/a
Meas. Tech.ChEMBL_632259 (CHEMBL1110121)
IC50 1.3±n/a nM
Citation Lawandi, JGerber-Lemaire, SJuillerat-Jeanneret, LMoitessier, N Inhibitors of prolyl oligopeptidases for the therapy of human diseases: defining diseases and inhibitors. J Med Chem53:3423-38 (2010) 
 
Prolyl endopeptidase
Name:Prolyl endopeptidase
Type:n/a
Mol. Mass.:80758.04
Organism:Sus scrofa
Description:n/a
Residue:710
BDBM50051539
NameBDBM50051539
Synonyms:(S)-4-phenyl-1-(2-(pyrrolidine-1-carbonyl)pyrrolidin-1-yl)butan-1-one 4-Phenyl-1-[2-(pyrrolidine-1-carbonyl)-pyrrolidin-1-yl]-butan-1-one SUAM-1221
TypeSmall organic molecule
Emp. Form.C19H26N2O2
Mol. Mass.314.4219
SMILESO=C(CCCc1ccccc1)N1CCC[C@H]1C(=O)N1CCCC1