Reaction Details
TargetProlyl endopeptidase
LigandBDBM50193665
Substrate/Competitorn/a
Meas. Tech.ChEMBL_632259 (CHEMBL1110121)
IC50 1.2±n/a nM
Citation Lawandi, JGerber-Lemaire, SJuillerat-Jeanneret, LMoitessier, N Inhibitors of prolyl oligopeptidases for the therapy of human diseases: defining diseases and inhibitors. J Med Chem53:3423-38 (2010) 
 
Prolyl endopeptidase
Name:Prolyl endopeptidase
Type:n/a
Mol. Mass.:80758.04
Organism:Sus scrofa
Description:n/a
Residue:710
BDBM50193665
NameBDBM50193665
Synonyms:1-((2R,5S)-2-tert-butyl-5-(pyrrolidine-1-carbonyl)pyrrolidin-1-yl)-4-phenylbutan-1-one | CHEMBL375794
TypeSmall organic molecule
Emp. Form.C23H34N2O2
Mol. Mass.370.5283
SMILESCC(C)(C)[C@H]1CC[C@H](N1C(=O)CCCc1ccccc1)C(=O)N1CCCC1