Reaction Details
TargetProlyl endopeptidase
LigandBDBM50316821
Substrate/Competitorn/a
Meas. Tech.ChEMBL_632259 (CHEMBL1110121)
IC50 1.05±n/a nM
Citation Lawandi, JGerber-Lemaire, SJuillerat-Jeanneret, LMoitessier, N Inhibitors of prolyl oligopeptidases for the therapy of human diseases: defining diseases and inhibitors. J Med Chem53:3423-38 (2010) 
 
Prolyl endopeptidase
Name:Prolyl endopeptidase
Type:n/a
Mol. Mass.:80758.04
Organism:Sus scrofa
Description:n/a
Residue:710
BDBM50316821
NameBDBM50316821
Synonyms:CHEMBL1096175 | N-((S)-3-methyl-1-oxo-1-((S)-2-(piperidine-1-carbonyl)pyrrolidin-1-yl)butan-2-yl)-3-phenoxybenzamide
TypeSmall organic molecule
Emp. Form.C28H35N3O4
Mol. Mass.477.5952
SMILESCC(C)[C@H](NC(=O)c1cccc(Oc2ccccc2)c1)C(=O)N1CCC[C@H]1C(=O)N1CCCCC1