Reaction Details
TargetProlyl endopeptidase
LigandBDBM50051547
Substrate/Competitorn/a
Meas. Tech.ChEMBL_632259 (CHEMBL1110121)
IC50 29±n/a nM
Citation Lawandi, JGerber-Lemaire, SJuillerat-Jeanneret, LMoitessier, N Inhibitors of prolyl oligopeptidases for the therapy of human diseases: defining diseases and inhibitors. J Med Chem53:3423-38 (2010) 
 
Prolyl endopeptidase
Name:Prolyl endopeptidase
Type:n/a
Mol. Mass.:80758.04
Organism:Sus scrofa
Description:n/a
Residue:710
BDBM50051547
NameBDBM50051547
Synonyms:(S)-2-(Pyrrolidine-1-carbonyl)-pyrrolidine-1-carboxylic acid tert-butyl ester CHEMBL311364
TypeSmall organic molecule
Emp. Form.C14H24N2O3
Mol. Mass.268.352
SMILESCC(C)(C)OC(=O)N1CCC[C@H]1C(=O)N1CCCC1