Reaction Details
TargetCarbonic anhydrase 4
LigandBDBM50317396
Substrate/Competitorn/a
Meas. Tech.ChEMBL_631615 (CHEMBL1106609)
IC50 1450±n/a nM
Citation Vernier, WChong, WRewolinski, DGreasley, SPauly, TShaw, MDinh, DFerre, RAMeador, JWNukui, SOrnelas, MPaz, RLReyner, E Thioether benzenesulfonamide inhibitors of carbonic anhydrases II and IV: structure-based drug design, synthesis, and biological evaluation. Bioorg Med Chem18:3307-19 (2010) 
 
Carbonic anhydrase 4
Name:Carbonic anhydrase 4
Type:Enzyme
Mol. Mass.:35037.98
Organism:Homo sapiens (Human)
Description:P22748
Residue:312
BDBM50317396
NameBDBM50317396
Synonyms:5-(Aminosulfonyl)-N-benzyl-2-(phenylsulfonyl)benzamide | CHEMBL1098526
TypeSmall organic molecule
Emp. Form.C20H18N2O5S2
Mol. Mass.430.497
SMILESNS(=O)(=O)c1ccc(c(c1)C(=O)NCc1ccccc1)S(=O)(=O)c1ccccc1