Reaction Details
TargetCarbonic anhydrase 4
LigandBDBM50317401
Substrate/Competitorn/a
Meas. Tech.ChEMBL_631615 (CHEMBL1106609)
IC50 229±n/a nM
Citation Vernier, WChong, WRewolinski, DGreasley, SPauly, TShaw, MDinh, DFerre, RAMeador, JWNukui, SOrnelas, MPaz, RLReyner, E Thioether benzenesulfonamide inhibitors of carbonic anhydrases II and IV: structure-based drug design, synthesis, and biological evaluation. Bioorg Med Chem18:3307-19 (2010) 
 
Carbonic anhydrase 4
Name:Carbonic anhydrase 4
Type:Enzyme
Mol. Mass.:35037.98
Organism:Homo sapiens (Human)
Description:P22748
Residue:312
BDBM50317401
NameBDBM50317401
Synonyms:5-(Aminosulfonyl)-2-(phenylthio)-N-propylnicotinamide | CHEMBL1099125
TypeSmall organic molecule
Emp. Form.C15H17N3O3S2
Mol. Mass.351.444
SMILESCCCNC(=O)c1cc(cnc1Sc1ccccc1)S(N)(=O)=O