Reaction Details
TargetCarbonic anhydrase 4
LigandBDBM50317403
Substrate/Competitorn/a
Meas. Tech.ChEMBL_631615 (CHEMBL1106609)
IC50 23±n/a nM
Citation Vernier, WChong, WRewolinski, DGreasley, SPauly, TShaw, MDinh, DFerre, RAMeador, JWNukui, SOrnelas, MPaz, RLReyner, E Thioether benzenesulfonamide inhibitors of carbonic anhydrases II and IV: structure-based drug design, synthesis, and biological evaluation. Bioorg Med Chem18:3307-19 (2010) 
 
Carbonic anhydrase 4
Name:Carbonic anhydrase 4
Type:Enzyme
Mol. Mass.:35037.98
Organism:Homo sapiens (Human)
Description:P22748
Residue:312
BDBM50317403
NameBDBM50317403
Synonyms:5-(Aminosulfonyl)-N-(pyridin-2-ylmethyl)-2-[(2,3,5,6-tetrafluorophenyl)thio]nicotinamide | CHEMBL1098839
TypeSmall organic molecule
Emp. Form.C18H12F4N4O3S2
Mol. Mass.472.436
SMILESNS(=O)(=O)c1cnc(Sc2c(F)c(F)cc(F)c2F)c(c1)C(=O)NCc1ccccn1