Reaction Details
TargetTranscription factor p65
LigandBDBM50317857
Substrate/Competitorn/a
Meas. Tech.ChEMBL_629938 (CHEMBL1109182)
IC50 2000±n/a nM
Citation Ren, YKardono, LBRiswan, SChai, HFarnsworth, NRSoejarto, DDCarcache de Blanco, EJKinghorn, AD Cytotoxic and NF-kappaB inhibitory constituents of Artocarpus rigida. J Nat Prod73:949-55 (2010) 
 
Transcription factor p65
Name:Transcription factor p65
Type:Enzyme
Mol. Mass.:60211.92
Organism:Homo sapiens (Human)
Description:Q04206
Residue:551
BDBM50317857
NameBDBM50317857
Synonyms:Artorigidin A | CHEMBL1094756
TypeSmall organic molecule
Emp. Form.C30H32O7
Mol. Mass.504.5709
SMILES[#6]\[#6](-[#6])=[#6]\[#6]-c1c(-[#8])c(-[#6]\[#6]=[#6](\[#6])-[#6])c2oc-3c(-[#6]-[#6@H](-[#6](-[#6])=[#6])-c4c(-[#8])c(-[#8])cc(-[#8])c-34)c(=O)c2c1-[#8]