Reaction Details
TargetHistone deacetylase 8
LigandBDBM50317951
Substrate/Competitorn/a
Meas. Tech.ChEMBL_630915 (CHEMBL1113907)
IC50 25±n/a nM
Citation Bressi, JCde Jong, RWu, YJennings, AJBrown, JWO'Connell, STari, LWSkene, RJVu, PNavre, MCao, XGangloff, AR Benzimidazole and imidazole inhibitors of histone deacetylases: Synthesis and biological activity. Bioorg Med Chem Lett20:3138-41 (2010) 
 
Histone deacetylase 8
Name:Histone deacetylase 8
Type:Enzyme
Mol. Mass.:41749.60
Organism:Homo sapiens (Human)
Description:Q9BY41
Residue:377
BDBM50317951
NameBDBM50317951
Synonyms:CHEMBL1096433 | N-hydroxy-3-(3-(4-methyl-1-phenethyl-5-phenyl-1H-imidazol-2-yl)phenyl)acrylamide
TypeSmall organic molecule
Emp. Form.C27H25N3O2
Mol. Mass.423.5063
SMILESCc1nc(-c2cccc(\C=C\C(=O)NO)c2)n(CCc2ccccc2)c1-c1ccccc1