Reaction Details
TargetHistone deacetylase 8
LigandBDBM50317960
Substrate/Competitorn/a
Meas. Tech.ChEMBL_630915 (CHEMBL1113907)
IC50 20±n/a nM
Citation Bressi, JCde Jong, RWu, YJennings, AJBrown, JWO'Connell, STari, LWSkene, RJVu, PNavre, MCao, XGangloff, AR Benzimidazole and imidazole inhibitors of histone deacetylases: Synthesis and biological activity. Bioorg Med Chem Lett20:3138-41 (2010) 
 
Histone deacetylase 8
Name:Histone deacetylase 8
Type:Enzyme
Mol. Mass.:41749.60
Organism:Homo sapiens (Human)
Description:Q9BY41
Residue:377
BDBM50317960
NameBDBM50317960
Synonyms:3-(3-(5-benzyl-4-methyl-1-phenethyl-1H-imidazol-2-yl)phenyl)-N-hydroxyacrylamide | CHEMBL1096705
TypeSmall organic molecule
Emp. Form.C28H27N3O2
Mol. Mass.437.5329
SMILESCc1nc(-c2cccc(\C=C\C(=O)NO)c2)n(CCc2ccccc2)c1Cc1ccccc1