Reaction Details
TargetHistone deacetylase 8
LigandBDBM50317966
Substrate/Competitorn/a
Meas. Tech.ChEMBL_630915 (CHEMBL1113907)
IC50 25±n/a nM
Citation Bressi, JCde Jong, RWu, YJennings, AJBrown, JWO'Connell, STari, LWSkene, RJVu, PNavre, MCao, XGangloff, AR Benzimidazole and imidazole inhibitors of histone deacetylases: Synthesis and biological activity. Bioorg Med Chem Lett20:3138-41 (2010) 
 
Histone deacetylase 8
Name:Histone deacetylase 8
Type:Enzyme
Mol. Mass.:41749.60
Organism:Homo sapiens (Human)
Description:Q9BY41
Residue:377
BDBM50317966
NameBDBM50317966
Synonyms:CHEMBL1097761 | N-hydroxy-3-(3-(1-(3-phenylpropyl)-1H-benzo[d]imidazol-2-yl)phenyl)acrylamide
TypeSmall organic molecule
Emp. Form.C25H23N3O2
Mol. Mass.397.469
SMILESONC(=O)\C=C\c1cccc(c1)-c1nc2ccccc2n1CCCc1ccccc1