Reaction Details
TargetHistone deacetylase 8
LigandBDBM50317969
Substrate/Competitorn/a
Meas. Tech.ChEMBL_630915 (CHEMBL1113907)
IC50 16±n/a nM
Citation Bressi, JCde Jong, RWu, YJennings, AJBrown, JWO'Connell, STari, LWSkene, RJVu, PNavre, MCao, XGangloff, AR Benzimidazole and imidazole inhibitors of histone deacetylases: Synthesis and biological activity. Bioorg Med Chem Lett20:3138-41 (2010) 
 
Histone deacetylase 8
Name:Histone deacetylase 8
Type:Enzyme
Mol. Mass.:41749.60
Organism:Homo sapiens (Human)
Description:Q9BY41
Residue:377
BDBM50317969
NameBDBM50317969
Synonyms:(S)-N-hydroxy-3-(3-(1-(1-phenylethyl)-1H-benzo[d]imidazol-2-yl)phenyl)acrylamide | CHEMBL1094793
TypeSmall organic molecule
Emp. Form.C24H21N3O2
Mol. Mass.383.4424
SMILESC[C@@H](c1ccccc1)n1c(nc2ccccc12)-c1cccc(\C=C\C(=O)NO)c1