Reaction Details
TargetGlutamate receptor 2
LigandBDBM17657
Substrate/Competitorn/a
Meas. Tech.ChEMBL_629334 (CHEMBL1104014)
EC50 14000±n/a nM
Citation Lolli, MLGiordano, CPickering, DSRolando, BHansen, KBFoti, AContreras-Sanz, AAmir, AFruttero, RGasco, ANielsen, BJohansen, TN 4-hydroxy-1,2,5-oxadiazol-3-yl moiety as bioisoster of the carboxy function. Synthesis, ionization constants, and molecular pharmacological characterization at ionotropic glutamate receptors of compounds related to glutamate and its homologues. J Med Chem53:4110-8 (2010) 
 
Glutamate receptor 2
Name:Glutamate receptor 2
Type:Enzyme Catalytic Domain
Mol. Mass.:98825.96
Organism:Homo sapiens (Human)
Description:Glutamate AMPA 2 GRIA2 HUMAN::P42262
Residue:883
BDBM17657
NameBDBM17657
Synonyms:(2S)-2-aminopentanedioic acid D-Glutamate L-Glu L-Glutamic acid L-gluatmate
TypeAmino Acid
Emp. Form.C5H9NO4
Mol. Mass.147.1293
SMILESN[C@@H](CCC(O)=O)C(O)=O