Reaction Details
TargetAdenosine receptor A3
LigandBDBM50318267
Substrate/Competitorn/a
Meas. Tech.ChEMBL_629508 (CHEMBL1120797)
Ki 0.18±n/a nM
Citation Taliani, SLa Motta, CMugnaini, LSimorini, FSalerno, SMarini, AMDa Settimo, FCosconati, SCosimelli, BGreco, GLimongelli, VMarinelli, LNovellino, ECiampi, ODaniele, STrincavelli, MLMartini, C Novel N2-substituted pyrazolo[3,4-d]pyrimidine adenosine A3 receptor antagonists: inhibition of A3-mediated human glioblastoma cell proliferation. J Med Chem53:3954-63 (2010) 
 
Adenosine receptor A3
Name:Adenosine receptor A3
Type:G Protein-Coupled Receptor (GPCR)
Mol. Mass.:36197.32
Organism:Homo sapiens (Human)
Description:P0DMS8
Residue:318
BDBM50318267
NameBDBM50318267
Synonyms:4-methoxy-N-(2-methyl-6-phenyl-2H-pyrazolo[3,4-d]pyrimidin-4-yl)benzamide | CHEMBL1098108
TypeSmall organic molecule
Emp. Form.C20H17N5O2
Mol. Mass.359.3813
SMILESCOc1ccc(cc1)C(=O)Nc1nc(nc2nn(C)cc12)-c1ccccc1