Reaction Details
TargetNuclear receptor subfamily 1 group I member 2
LigandBDBM50377913
Substrate/Competitorn/a
Meas. Tech.ChEMBL_629566 (CHEMBL1120984)
Ki 27±n/a nM
Citation Nahrstedt, AButterweck, V Lessons learned from herbal medicinal products: the example of St. John's Wort (perpendicular). J Nat Prod73:1015-21 (2010) 
 
Nuclear receptor subfamily 1 group I member 2
Name:Nuclear receptor subfamily 1 group I member 2
Type:Nuclear receptor
Mol. Mass.:49774.77
Organism:Homo sapiens (Human)
Description:O75469
Residue:434
BDBM50377913
NameBDBM50377913
Synonyms:HYPERFORIN
TypeSmall organic molecule
Emp. Form.C35H52O4
Mol. Mass.536.785
SMILES[#6]-[#6](-[#6])-[#6](=O)[C@@]12[#6](=O)-[#6](-[#6]\[#6]=[#6](\[#6])-[#6])-[#6](=O)[C@@]([#6]\[#6]=[#6](\[#6])-[#6])([#6]-[#6@H](-[#6]\[#6]=[#6](\[#6])-[#6])[C@@]1([#6])[#6]-[#6]\[#6]=[#6](\[#6])-[#6])[#6]2=O