Reaction Details
TargetAromatase
LigandBDBM10015
Substrate/Competitorn/a
Meas. Tech.ChEMBL_630232 (CHEMBL1105634)
IC50 15±n/a nM
Citation Muftuoglu, YMustata, G Pharmacophore modeling strategies for the development of novel nonsteroidal inhibitors of human aromatase (CYP19). Bioorg Med Chem Lett20:3050-64 (2010) 
 
Aromatase
Name:Aromatase
Type:Enzyme
Mol. Mass.:57888.92
Organism:Homo sapiens (Human)
Description:P11511
Residue:503
BDBM10015
NameBDBM10015
Synonyms:2-[3-(1-cyano-1-methylethyl)-5-(1H-1,2,4-triazol-1-ylmethyl)phenyl]-2-methylpropanenitrile ANASTROZOLE NSC719344 | arimidex
TypeSmall organic molecule
Emp. Form.C17H19N5
Mol. Mass.293.3663
SMILESCC(C)(C#N)c1cc(Cn2cncn2)cc(c1)C(C)(C)C#N