Reaction Details
TargetAromatase
LigandBDBM50014323
Substrate/Competitorn/a
Meas. Tech.ChEMBL_630232 (CHEMBL1105634)
IC50 70±n/a nM
Citation Muftuoglu, YMustata, G Pharmacophore modeling strategies for the development of novel nonsteroidal inhibitors of human aromatase (CYP19). Bioorg Med Chem Lett20:3050-64 (2010) 
 
Aromatase
Name:Aromatase
Type:Enzyme
Mol. Mass.:57888.92
Organism:Homo sapiens (Human)
Description:P11511
Residue:503
BDBM50014323
NameBDBM50014323
Synonyms:2-PHENYL-4H-BENZO[H]CHROMEN-4-ONE 7,8-Benzoflavone alpha-naphthoflavone
TypeSmall organic molecule
Emp. Form.C19H12O2
Mol. Mass.272.2974
SMILESO=c1cc(oc2c3ccccc3ccc12)-c1ccccc1