Reaction Details
TargetTransient receptor potential cation channel subfamily A member 1
LigandBDBM50318456
Substrate/Competitorn/a
Meas. Tech.ChEMBL_633032 (CHEMBL1118500)
IC50 260±n/a nM
Citation Baraldi, PGPreti, DMaterazzi, SGeppetti, P Transient receptor potential ankyrin 1 (TRPA1) channel as emerging target for novel analgesics and anti-inflammatory agents. J Med Chem53:5085-107 (2010) 
 
Transient receptor potential cation channel subfamily A member 1
Name:Transient receptor potential cation channel subfamily A member 1
Type:Protein
Mol. Mass.:127514.20
Organism:Homo sapiens (Human)
Description:O75762
Residue:1119
BDBM50318456
NameBDBM50318456
Synonyms:4-methoxy-N-(2,2,2-trichloro-1-(4-chlorophenylthio)ethyl)benzamide CHEMBL1086586
TypeSmall organic molecule
Emp. Form.C16H13Cl4NO2S
Mol. Mass.425.157
SMILESCOc1ccc(cc1)C(=O)NC(Sc1ccc(Cl)cc1)C(Cl)(Cl)Cl