Reaction Details
TargetTransient receptor potential cation channel subfamily A member 1
LigandBDBM50318465
Substrate/Competitorn/a
Meas. Tech.ChEMBL_633002 (CHEMBL1118227)
IC50 500±n/a nM
Citation Baraldi, PGPreti, DMaterazzi, SGeppetti, P Transient receptor potential ankyrin 1 (TRPA1) channel as emerging target for novel analgesics and anti-inflammatory agents. J Med Chem53:5085-107 (2010) 
 
Transient receptor potential cation channel subfamily A member 1
Name:Transient receptor potential cation channel subfamily A member 1
Type:Protein
Mol. Mass.:127514.20
Organism:Homo sapiens (Human)
Description:O75762
Residue:1119
BDBM50318465
NameBDBM50318465
Synonyms:CHEMBL1085863 | N-(4-(4-chlorophenyl)thiazol-2-yl)-2-(2-methyl-1,3-dioxoisoindolin-4-yl)acetamide
TypeSmall organic molecule
Emp. Form.C20H14ClN3O3S
Mol. Mass.411.861
SMILESCN1C(=O)c2cccc(CC(=O)Nc3nc(cs3)-c3ccc(Cl)cc3)c2C1=O