Reaction Details
TargetTransient receptor potential cation channel subfamily A member 1
LigandBDBM50305207
Substrate/Competitorn/a
Meas. Tech.ChEMBL_633001 (CHEMBL1118226)
IC50 3100±n/a nM
Citation Baraldi, PGPreti, DMaterazzi, SGeppetti, P Transient receptor potential ankyrin 1 (TRPA1) channel as emerging target for novel analgesics and anti-inflammatory agents. J Med Chem53:5085-107 (2010) 
 
Transient receptor potential cation channel subfamily A member 1
Name:Transient receptor potential cation channel subfamily A member 1
Type:Protein
Mol. Mass.:127514.20
Organism:Homo sapiens (Human)
Description:O75762
Residue:1119
BDBM50305207
NameBDBM50305207
Synonyms:4-(4-chlorophenyl)-3-methylbut-3-en-2-one oxime | CHEMBL593902
TypeSmall organic molecule
Emp. Form.C11H12ClNO
Mol. Mass.209.672
SMILESCC(N=O)C(C)=Cc1ccc(Cl)cc1