Reaction Details
TargetTransient receptor potential cation channel subfamily A member 1
LigandBDBM50318472
Substrate/Competitorn/a
Meas. Tech.ChEMBL_633001 (CHEMBL1118226)
IC50 23400±n/a nM
Citation Baraldi, PGPreti, DMaterazzi, SGeppetti, P Transient receptor potential ankyrin 1 (TRPA1) channel as emerging target for novel analgesics and anti-inflammatory agents. J Med Chem53:5085-107 (2010) 
 
Transient receptor potential cation channel subfamily A member 1
Name:Transient receptor potential cation channel subfamily A member 1
Type:Protein
Mol. Mass.:127514.20
Organism:Homo sapiens (Human)
Description:O75762
Residue:1119
BDBM50318472
NameBDBM50318472
Synonyms:1-(6-methoxypyridin-3-yl)-2-methylpent-1-en-3-one oximev | CHEMBL1084370
TypeSmall organic molecule
Emp. Form.C12H16N2O2
Mol. Mass.220.2676
SMILESCCC(N=O)C(C)=Cc1ccc(OC)nc1