Reaction Details
TargetTransient receptor potential cation channel subfamily A member 1
LigandBDBM50318474
Substrate/Competitorn/a
Meas. Tech.ChEMBL_633001 (CHEMBL1118226)
IC50 17000±n/a nM
Citation Baraldi, PGPreti, DMaterazzi, SGeppetti, P Transient receptor potential ankyrin 1 (TRPA1) channel as emerging target for novel analgesics and anti-inflammatory agents. J Med Chem53:5085-107 (2010) 
 
Transient receptor potential cation channel subfamily A member 1
Name:Transient receptor potential cation channel subfamily A member 1
Type:Protein
Mol. Mass.:127514.20
Organism:Homo sapiens (Human)
Description:O75762
Residue:1119
BDBM50318474
NameBDBM50318474
Synonyms:2-methyl-1-(pyridin-3-yl)pent-1-en-3-one oxime | CHEMBL1084371
TypeSmall organic molecule
Emp. Form.C11H14N2O
Mol. Mass.190.2417
SMILESCCC(N=O)C(C)=Cc1cccnc1