Reaction Details
TargetTransient receptor potential cation channel subfamily A member 1
LigandBDBM50318516
Substrate/Competitorn/a
Meas. Tech.ChEMBL_633001 (CHEMBL1118226)
IC50>100000±n/a nM
Citation Baraldi, PGPreti, DMaterazzi, SGeppetti, P Transient receptor potential ankyrin 1 (TRPA1) channel as emerging target for novel analgesics and anti-inflammatory agents. J Med Chem53:5085-107 (2010) 
 
Transient receptor potential cation channel subfamily A member 1
Name:Transient receptor potential cation channel subfamily A member 1
Type:Protein
Mol. Mass.:127514.20
Organism:Homo sapiens (Human)
Description:O75762
Residue:1119
BDBM50318516
NameBDBM50318516
Synonyms:2-methyl-1-(6-methylpyridin-3-yl)pent-1-en-3-one oxime | CHEMBL1084373
TypeSmall organic molecule
Emp. Form.C12H16N2O
Mol. Mass.204.2682
SMILESCCC(N=O)C(C)=Cc1ccc(C)nc1