Reaction Details
TargetTransient receptor potential cation channel subfamily A member 1
LigandBDBM50034278
Substrate/Competitorn/a
Meas. Tech.ChEMBL_633013 (CHEMBL1118238)
EC50 5000±n/a nM
Citation Baraldi, PGPreti, DMaterazzi, SGeppetti, P Transient receptor potential ankyrin 1 (TRPA1) channel as emerging target for novel analgesics and anti-inflammatory agents. J Med Chem53:5085-107 (2010) 
 
Transient receptor potential cation channel subfamily A member 1
Name:Transient receptor potential cation channel subfamily A member 1
Type:Protein
Mol. Mass.:127514.20
Organism:Homo sapiens (Human)
Description:O75762
Residue:1119
BDBM50034278
NameBDBM50034278
Synonyms:2-((2E,6E)-3,7,11-Trimethyl-dodeca-2,6,10-trienylsulfanyl)-benzoic acid Farnesylthiosalicyclic acid S-trans,trans-farnesylthiosalicylic acid
TypeSmall organic molecule
Emp. Form.C22H30O2S
Mol. Mass.358.537
SMILES[#6]\[#6](-[#6])=[#6]\[#6]-[#6]\[#6](-[#6])=[#6]\[#6]-[#6]\[#6](-[#6])=[#6]\[#6]-[#16]-c1ccccc1-[#6](-[#8])=O