Reaction Details
TargetWD repeat-containing protein 5
LigandBDBM50318529
Substrate/Competitorn/a
Meas. Tech.ChEMBL_633068 (CHEMBL1118768)
Ki 9000±n/a nM
Citation Karatas, HTownsend, ECBernard, DDou, YWang, S Analysis of the binding of mixed lineage leukemia 1 (MLL1) and histone 3 peptides to WD repeat domain 5 (WDR5) for the design of inhibitors of the MLL1-WDR5 interaction. J Med Chem53:5179-85 (2010) 
 
WD repeat-containing protein 5
Name:WD repeat-containing protein 5
Type:Protein
Mol. Mass.:36597.13
Organism:Homo sapiens (Human)
Description:P61964
Residue:334
BDBM50318529
NameBDBM50318529
Synonyms:CHEMBL1082285 | H2N-ARTK(Me2)QTARKS-NH2
TypeSmall organic molecule
Emp. Form.C48H92N20O14
Mol. Mass.1173.3697
SMILES[#6]-[#7]-[#6]-[#6]-[#6]-[#6]-[#6@H](-[#7](-[#6])-[#6](=O)-[#6@@H](-[#7]-[#6](=O)-[#6@H](-[#6]-[#6]-[#6]\[#7]=[#6](/[#7])-[#7])-[#7]-[#6](=O)-[#6@H](-[#6])-[#7])-[#6@@H](-[#6])-[#8])-[#6](=O)-[#7]-[#6@@H](-[#6]-[#6]-[#6](-[#7])=O)-[#6](=O)-[#7]-[#6@@H](-[#6@@H](-[#6])-[#8])-[#6](=O)-[#7]-[#6@@H](-[#6])-[#6](=O)-[#7]-[#6@@H](-[#6]-[#6]-[#6]\[#7]=[#6](/[#7])-[#7])-[#6](=O)-[#7]-[#6@@H](-[#6]-[#6]-[#6]-[#6]-[#7])-[#6](=O)-[#7]-[#6@@H](-[#6]-[#8])-[#6](-[#7])=O