Reaction Details
TargetCytochrome P450 2A6
LigandBDBM50318596
Substrate/Competitorn/a
Meas. Tech.ChEMBL_633185 (CHEMBL1118622)
IC50>10000±n/a nM
Citation Bavetsias, VLarge, JMSun, CBouloc, NKosmopoulou, MMatteucci, MWilsher, NEMartins, VReynisson, JAtrash, BFaisal, AUrban, FValenti, Mde Haven Brandon, ABox, GRaynaud, FIWorkman, PEccles, SABayliss, RBlagg, JLinardopoulos, SMcDonald, E Imidazo[4,5-b]pyridine derivatives as inhibitors of Aurora kinases: lead optimization studies toward the identification of an orally bioavailable preclinical development candidate. J Med Chem53:5213-28 (2010) 
 
Cytochrome P450 2A6
Name:Cytochrome P450 2A6
Type:Protein
Mol. Mass.:56514.34
Organism:Homo sapiens (Human)
Description:P11509
Residue:494
BDBM50318596
NameBDBM50318596
Synonyms:3-((4-(6-Bromo-2-(4-(4-methylpiperazin-1-yl)phenyl)-3H-imidazo-[4,5-b]pyridin-7-yl)piperazin-1-yl)methyl)-5-methylisoxazole | CHEMBL1086579
TypeSmall organic molecule
Emp. Form.C20H27BrN8O
Mol. Mass.475.385
SMILESCN1CCN(CC1)c1nc2ncc(Br)c(N3CCN(Cc4cc(C)on4)CC3)c2[nH]1