Reaction Details
TargetAurora kinase A
LigandBDBM50318572
Substrate/Competitorn/a
Meas. Tech.ChEMBL_633156 (CHEMBL1119040)
IC50 16±n/a nM
Citation Bavetsias, VLarge, JMSun, CBouloc, NKosmopoulou, MMatteucci, MWilsher, NEMartins, VReynisson, JAtrash, BFaisal, AUrban, FValenti, Mde Haven Brandon, ABox, GRaynaud, FIWorkman, PEccles, SABayliss, RBlagg, JLinardopoulos, SMcDonald, E Imidazo[4,5-b]pyridine derivatives as inhibitors of Aurora kinases: lead optimization studies toward the identification of an orally bioavailable preclinical development candidate. J Med Chem53:5213-28 (2010) 
 
Aurora kinase A
Name:Aurora kinase A
Type:Serine/threonine-protein kinase
Mol. Mass.:45830.98
Organism:Homo sapiens (Human)
Description:O14965
Residue:403
BDBM50318572
NameBDBM50318572
Synonyms:2-{4-[6-Bromo-2-(4-dimethylaminomethylphenyl)-3H-imidazo[4,5-b]pyridin-7-yl]-piperazin-1-yl}-N-thiazol-2-yl-acetamide | CHEMBL1082507
TypeSmall organic molecule
Emp. Form.C24H27BrN8OS
Mol. Mass.555.493
SMILESCN(C)Cc1ccc(cc1)-c1nc2ncc(Br)c(N3CCN(CC(=O)Nc4nccs4)CC3)c2[nH]1