Reaction Details
TargetAurora kinase A
LigandBDBM50318582
Substrate/Competitorn/a
Meas. Tech.ChEMBL_633156 (CHEMBL1119040)
IC50 258±n/a nM
Citation Bavetsias, VLarge, JMSun, CBouloc, NKosmopoulou, MMatteucci, MWilsher, NEMartins, VReynisson, JAtrash, BFaisal, AUrban, FValenti, Mde Haven Brandon, ABox, GRaynaud, FIWorkman, PEccles, SABayliss, RBlagg, JLinardopoulos, SMcDonald, E Imidazo[4,5-b]pyridine derivatives as inhibitors of Aurora kinases: lead optimization studies toward the identification of an orally bioavailable preclinical development candidate. J Med Chem53:5213-28 (2010) 
 
Aurora kinase A
Name:Aurora kinase A
Type:Serine/threonine-protein kinase
Mol. Mass.:45830.98
Organism:Homo sapiens (Human)
Description:O14965
Residue:403
BDBM50318582
NameBDBM50318582
Synonyms:4-(6-Bromo-7-(4-phenylpiperazin-1-yl)-3H-imidazo[4,5-b]pyridin-2-yl)-N,Ndimethylaniline | CHEMBL1085135
TypeSmall organic molecule
Emp. Form.C24H25BrN6
Mol. Mass.477.4
SMILESCN(C)c1ccc(cc1)-c1nc2ncc(Br)c(N3CCN(CC3)c3ccccc3)c2[nH]1