Reaction Details
TargetAurora kinase A
LigandBDBM50318585
Substrate/Competitorn/a
Meas. Tech.ChEMBL_633156 (CHEMBL1119040)
IC50 79±n/a nM
Citation Bavetsias, VLarge, JMSun, CBouloc, NKosmopoulou, MMatteucci, MWilsher, NEMartins, VReynisson, JAtrash, BFaisal, AUrban, FValenti, Mde Haven Brandon, ABox, GRaynaud, FIWorkman, PEccles, SABayliss, RBlagg, JLinardopoulos, SMcDonald, E Imidazo[4,5-b]pyridine derivatives as inhibitors of Aurora kinases: lead optimization studies toward the identification of an orally bioavailable preclinical development candidate. J Med Chem53:5213-28 (2010) 
 
Aurora kinase A
Name:Aurora kinase A
Type:Serine/threonine-protein kinase
Mol. Mass.:45830.98
Organism:Homo sapiens (Human)
Description:O14965
Residue:403
BDBM50318585
NameBDBM50318585
Synonyms:4-(6-chloro-7-(4-(1-phenylethyl)piperazin-1-yl)-3H-imidazo[4,5-b]pyridin-2-yl)-N,N-dimethylaniline | CHEMBL1083490
TypeSmall organic molecule
Emp. Form.C26H29ClN6
Mol. Mass.461.002
SMILESCC(N1CCN(CC1)c1c(Cl)cnc2nc([nH]c12)-c1ccc(cc1)N(C)C)c1ccccc1