Reaction Details
TargetAurora kinase A
LigandBDBM50318589
Substrate/Competitorn/a
Meas. Tech.ChEMBL_633156 (CHEMBL1119040)
IC50 8±n/a nM
Citation Bavetsias, VLarge, JMSun, CBouloc, NKosmopoulou, MMatteucci, MWilsher, NEMartins, VReynisson, JAtrash, BFaisal, AUrban, FValenti, Mde Haven Brandon, ABox, GRaynaud, FIWorkman, PEccles, SABayliss, RBlagg, JLinardopoulos, SMcDonald, E Imidazo[4,5-b]pyridine derivatives as inhibitors of Aurora kinases: lead optimization studies toward the identification of an orally bioavailable preclinical development candidate. J Med Chem53:5213-28 (2010) 
 
Aurora kinase A
Name:Aurora kinase A
Type:Serine/threonine-protein kinase
Mol. Mass.:45830.98
Organism:Homo sapiens (Human)
Description:O14965
Residue:403
BDBM50318589
NameBDBM50318589
Synonyms:6-Bromo-2-(4-methoxyphenyl)-7-(4-(pyrimidin-5-ylmethyl)piperazin-1-yl)-3Himidazo[4,5-b]pyridine | CHEMBL1084859
TypeSmall organic molecule
Emp. Form.C22H22BrN7O
Mol. Mass.480.36
SMILESCOc1ccc(cc1)-c1nc2ncc(Br)c(N3CCN(Cc4cncnc4)CC3)c2[nH]1