Reaction Details
TargetAurora kinase A
LigandBDBM50318600
Substrate/Competitorn/a
Meas. Tech.ChEMBL_633156 (CHEMBL1119040)
IC50 30±n/a nM
Citation Bavetsias, VLarge, JMSun, CBouloc, NKosmopoulou, MMatteucci, MWilsher, NEMartins, VReynisson, JAtrash, BFaisal, AUrban, FValenti, Mde Haven Brandon, ABox, GRaynaud, FIWorkman, PEccles, SABayliss, RBlagg, JLinardopoulos, SMcDonald, E Imidazo[4,5-b]pyridine derivatives as inhibitors of Aurora kinases: lead optimization studies toward the identification of an orally bioavailable preclinical development candidate. J Med Chem53:5213-28 (2010) 
 
Aurora kinase A
Name:Aurora kinase A
Type:Serine/threonine-protein kinase
Mol. Mass.:45830.98
Organism:Homo sapiens (Human)
Description:O14965
Residue:403
BDBM50318600
NameBDBM50318600
Synonyms:4-(4-(6-Bromo-7-(4-((1-methyl-1H-imidazol-2-yl)methyl)piperazin-1-yl)-3Himidazo[4,5-b]pyridin-2-yl)benzyl)morpholine | CHEMBL1084889
TypeSmall organic molecule
Emp. Form.C26H31BrN8O
Mol. Mass.551.481
SMILESCn1ccnc1CN1CCN(CC1)c1c(Br)cnc2nc([nH]c12)-c1ccc(CN2CCOCC2)cc1