Reaction Details
TargetAurora kinase A
LigandBDBM50318609
Substrate/Competitorn/a
Meas. Tech.ChEMBL_633156 (CHEMBL1119040)
IC50 10±n/a nM
Citation Bavetsias, VLarge, JMSun, CBouloc, NKosmopoulou, MMatteucci, MWilsher, NEMartins, VReynisson, JAtrash, BFaisal, AUrban, FValenti, Mde Haven Brandon, ABox, GRaynaud, FIWorkman, PEccles, SABayliss, RBlagg, JLinardopoulos, SMcDonald, E Imidazo[4,5-b]pyridine derivatives as inhibitors of Aurora kinases: lead optimization studies toward the identification of an orally bioavailable preclinical development candidate. J Med Chem53:5213-28 (2010) 
 
Aurora kinase A
Name:Aurora kinase A
Type:Serine/threonine-protein kinase
Mol. Mass.:45830.98
Organism:Homo sapiens (Human)
Description:O14965
Residue:403
BDBM50318609
NameBDBM50318609
Synonyms:3-((4-(6-Bromo-2-(4-(piperazin-1-yl)phenyl)-3H-imidazo[4,5-b]pyridin-7-yl)piperazin-1-yl)methyl)-5-methylisoxazole | CHEMBL1084636
TypeSmall organic molecule
Emp. Form.C19H25BrN8O
Mol. Mass.461.359
SMILESCc1cc(CN2CCN(CC2)c2c(Br)cnc3nc([nH]c23)N2CCNCC2)no1