Reaction Details
TargetCytochrome P450 2C9
LigandBDBM50318670
Substrate/Competitorn/a
Meas. Tech.ChEMBL_633293 (CHEMBL1119997)
IC50 1720±n/a nM
Citation Yeung, BKZou, BRottmann, MLakshminarayana, SBAng, SHLeong, SYTan, JWong, JKeller-Maerki, SFischli, CGoh, ASchmitt, EKKrastel, PFrancotte, EKuhen, KPlouffe, DHenson, KWagner, TWinzeler, EAPetersen, FBrun, RDartois, VDiagana, TTKeller, TH Spirotetrahydro beta-carbolines (spiroindolones): a new class of potent and orally efficacious compounds for the treatment of malaria. J Med Chem53:5155-64 (2010) 
 
Cytochrome P450 2C9
Name:Cytochrome P450 2C9
Type:Enzyme
Mol. Mass.:55636.33
Organism:Homo sapiens (Human)
Description:P11712
Residue:490
BDBM50318670
NameBDBM50318670
Synonyms:(1R,3S)-5'-Chloro-6-fluoro-3-methyl-2,3,4,9-tetrahydrospiro-[beta-carboline-1,3'-indol]-2'(1'H)-one | CHEMBL1084349
TypeSmall organic molecule
Emp. Form.C19H15ClFN3O
Mol. Mass.355.793
SMILESC[C@H]1Cc2c([nH]c3ccc(F)cc23)[C@@]2(N1)C(=O)Nc1ccc(Cl)cc21