Reaction Details
TargetPotassium voltage-gated channel subfamily H member 2
LigandBDBM50318672
Substrate/Competitorn/a
Meas. Tech.ChEMBL_633292 (CHEMBL1119996)
IC50>30000±n/a nM
Citation Yeung, BKZou, BRottmann, MLakshminarayana, SBAng, SHLeong, SYTan, JWong, JKeller-Maerki, SFischli, CGoh, ASchmitt, EKKrastel, PFrancotte, EKuhen, KPlouffe, DHenson, KWagner, TWinzeler, EAPetersen, FBrun, RDartois, VDiagana, TTKeller, TH Spirotetrahydro beta-carbolines (spiroindolones): a new class of potent and orally efficacious compounds for the treatment of malaria. J Med Chem53:5155-64 (2010) 
 
Potassium voltage-gated channel subfamily H member 2
Name:Potassium voltage-gated channel subfamily H member 2
Type:Multi-pass membrane protein
Mol. Mass.:126672.65
Organism:Homo sapiens (Human)
Description:Q12809
Residue:1159
BDBM50318672
NameBDBM50318672
Synonyms:(1R,3S)-5'-Chloro-3-methyl-2,3,4,9-tetrahydrospiro[beta-carboline-1,3'-indol-2'(1'H)-one | CHEMBL1083769
TypeSmall organic molecule
Emp. Form.C19H16ClN3O
Mol. Mass.337.803
SMILESC[C@H]1Cc2c([nH]c3ccccc23)[C@@]2(N1)C(=O)Nc1ccc(Cl)cc21