Reaction Details
TargetDynamin-2
LigandBDBM50318676
Substrate/Competitorn/a
Meas. Tech.ChEMBL_633477 (CHEMBL1119289)
IC50 40000±n/a nM
Citation Odell, LRHowan, DGordon, CPRobertson, MJChau, NMariana, AWhiting, AEAbagyan, RDaniel, JAGorgani, NNRobinson, PJMcCluskey, A The pthaladyns: GTP competitive inhibitors of dynamin I and II GTPase derived from virtual screening. J Med Chem53:5267-80 (2010) 
 
Dynamin-2
Name:Dynamin-2
Type:PROTEIN
Mol. Mass.:98071.19
Organism:Homo sapiens (Human)
Description:ChEMBL_934670
Residue:870
BDBM50318676
NameBDBM50318676
Synonyms:4-Chloro-2-{[2-(4-hydroxymethylphenyl)-1,3-dioxo-2,3-dihydro-1H-isoindole-5-carbonyl]amino}benzoic Acid | CHEMBL1084521
TypeSmall organic molecule
Emp. Form.C23H15ClN2O6
Mol. Mass.450.828
SMILESOCc1ccc(cc1)N1C(=O)c2ccc(cc2C1=O)C(=O)Nc1cc(Cl)ccc1C(O)=O