Reaction Details
TargetDelta-type opioid receptor
LigandBDBM50378782
Substrate/Competitorn/a
Meas. Tech.ChEMBL_633487 (CHEMBL1119299)
EC50 380±n/a nM
Citation Runyon, SPBrieaddy, LEMascarella, SWThomas, JBNavarro, HAHoward, JLPollard, GTCarroll, FI Analogues of (3R)-7-hydroxy-N-[(1S)-1-{[(3R,4R)-4-(3-hydroxyphenyl)-3,4-dimethyl-1-piperidinyl]methyl}-2-methylpropyl)-1,2,3,4-tetrahydro-3-isoquinolinecarboxamide (JDTic). Synthesis and in vitro and in vivo opioid receptor antagonist activity. J Med Chem53:5290-301 (2010) 
 
Delta-type opioid receptor
Name:Delta-type opioid receptor
Type:G Protein-Coupled Receptor (GPCR)
Mol. Mass.:40382.98
Organism:Homo sapiens (Human)
Description:Competition binding assays were carried out using membrane preparations from transfected HN9.10 cells that constitutively expressed the delta opioid receptor.
Residue:372
BDBM50378782
NameBDBM50378782
Synonyms:CHEMBL1204084
TypeSmall organic molecule
Emp. Form.C29H36N2O3
Mol. Mass.460.6077
SMILESCC(C)[C@@H](CN1CC[C@](C)([C@@H](C)C1)c1cccc(O)c1)NC(=O)c1ccc2cc(O)ccc2c1