Reaction Details
TargetMu-type opioid receptor
LigandBDBM50318683
Substrate/Competitorn/a
Meas. Tech.ChEMBL_633486 (CHEMBL1119298)
EC50 120±n/a nM
Citation Runyon, SPBrieaddy, LEMascarella, SWThomas, JBNavarro, HAHoward, JLPollard, GTCarroll, FI Analogues of (3R)-7-hydroxy-N-[(1S)-1-{[(3R,4R)-4-(3-hydroxyphenyl)-3,4-dimethyl-1-piperidinyl]methyl}-2-methylpropyl)-1,2,3,4-tetrahydro-3-isoquinolinecarboxamide (JDTic). Synthesis and in vitro and in vivo opioid receptor antagonist activity. J Med Chem53:5290-301 (2010) 
 
Mu-type opioid receptor
Name:Mu-type opioid receptor
Type:G Protein-Coupled Receptor (GPCR)
Mol. Mass.:44789.51
Organism:Homo sapiens (Human)
Description:P35372
Residue:400
BDBM50318683
NameBDBM50318683
Synonyms:6-Hydroxy-1,2,3,4-tetrahydro-naphthalene-2(-)-carboxylic Acid-{1-[4-(3-hydroxyphenyl)-(3R,4R)-trans-dimethyl-piperidinylmethyl]-(2S)-methylpropyl}amide | CHEMBL1085024
TypeSmall organic molecule
Emp. Form.C29H40N2O3
Mol. Mass.464.6395
SMILESCC(C)[C@@H](CN1CC[C@](C)([C@@H](C)C1)c1cccc(O)c1)NC(=O)[C@H]1CCc2cc(O)ccc2C1